{"text_format":"1","workbook":"xlsx","n_sheets":5,"sheets":["Sommaire","Mon établissement","Pistes d'action","Mon plan d'action","pour_master"],"not_rendered":{"charts":0,"images":24,"macros":1,"external_links":0,"defined_names":1,"comments":0,"pivot_tables":0},"unopened":[],"bounds":{"document_bytes":16777216,"sheet_cells":100000,"rows_first":2000,"rows_last":500,"rows_between":2000,"halvings":0,"cell_chars":16384,"cell_head_chars":4096},"cells_cut":0,"cells_raw":0,"read":"whole","date_system":"1900"}

{"sheet":"Sommaire","index":0,"n_rows":15,"n_cols":5,"rows_kept":15,"cut":false,"hidden":false,"merged":[[0,0,0,7],[1,0,1,1],[1,2,1,3],[1,4,1,5],[16,0,16,7]]}
["Sommaire    "]
[null,null,"Pistes d'action",null,"Mon plan d'action"]
[]
[]
[]
[]
[]
[]
[]
[null,null,"Je renseigne les données de mon établissement"]
[null,null,"Je sélectionne les actions à intégrer à mon plan d'action : "]
[null,null,null," - à partir des pistes d'action présentées dans cet outil"]
[null,null,null," - à partir du jeu de cartes fourni par Maison Gourmande et Responsable"]
[null,null,null," - à partir du livret téléchargeable"]
[null,null,"Je complète et imprime mon plan d'action"]

{"sheet":"Mon établissement","index":1,"n_rows":22,"n_cols":5,"rows_kept":22,"cut":false,"hidden":false,"merged":[[7,0,7,1],[7,2,7,7],[0,0,0,7],[1,0,1,1],[1,2,1,3],[1,4,1,5],[5,0,5,1],[5,2,5,7],[6,0,6,1],[6,2,6,7],[11,0,11,1],[11,2,11,7],[12,0,12,1],[13,0,13,1],[13,2,13,7],[14,0,14,1],[19,0,19,1],[19,2,19,5],[19,6,19,7],[20,0,20,1],[17,0,17,1],[17,2,17,5],[17,6,17,7],[18,0,18,1],[18,2,18,5],[18,6,18,7],[24,0,24,1],[23,0,23,1],[23,2,23,5],[23,6,23,7],[21,0,21,1],[21,2,21,5]]}
["Mon établissement    "]
[null,null,"Pistes d'action",null,"Mon plan d'action"]
[]
["INFORMATIONS GÉNÉRALES SUR L'ETABLISSEMENT"]
[]
["Nom de l'Etablissement",null,"Veuillez saisir ici votre réponse"]
[]
["Numéro de FINESS",null,"Veuillez saisir ici votre réponse"]
[]
["ADRESSE DE L'ENTREPRISE"]
[]
["Rue",null,"Veuillez saisir ici votre réponse"]
[]
["Code postal",null,"Veuillez saisir ici votre réponse"]
[]
["CONTACT DE L'UTILISATEUR QUI COMPLETE LE PLAN D'ACTION"]
[]
["Nom Prénom du référent",null,"Veuillez saisir ici votre réponse"]
[]
["Adresse mail",null,"Veuillez saisir ici votre réponse"]
[]
["Fonction",null,"Veuillez saisir ici votre réponse"]

{"sheet":"Pistes d'action","index":2,"n_rows":234,"n_cols":8,"rows_kept":234,"cut":false,"hidden":false,"merged":[[212,1,212,3],[224,1,224,3],[225,1,225,3],[227,1,227,3],[228,1,228,3],[229,1,229,3],[231,1,231,3],[232,1,232,3],[233,1,233,3],[213,1,213,3],[214,1,214,3],[215,1,215,3],[216,1,216,3],[217,1,217,3],[218,1,218,3],[219,1,219,3],[220,1,220,3],[221,1,221,3],[223,1,223,3],[230,1,230,3],[226,1,226,3],[202,1,202,3],[203,1,203,3],[204,1,204,3],[205,1,205,3],[206,1,206,3],[208,1,208,3],[209,1,209,3],[210,1,210,3],[211,1,211,3],[207,1,207,3],[192,1,192,3],[193,1,193,3],[195,1,195,3],[196,1,196,3],[197,1,197,3],[198,1,198,3],[199,1,199,3],[201,1,201,3],[194,1,194,3],[200,1,200,3],[125,1,125,3],[127,1,127,3],[128,1,128,3],[129,1,129,3],[130,1,130,3],[131,1,131,3],[133,1,133,3],[134,1,134,3],[155,1,155,3],[135,1,135,3],[136,1,136,3],[138,1,138,3],[139,1,139,3],[140,1,140,3],[142,1,142,3],[143,1,143,3],[146,1,146,3],[148,1,148,3],[149,1,149,3],[154,1,154,3],[144,1,144,3],[145,1,145,3],[99,1,99,3],[100,1,100,3],[101,1,101,3],[103,1,103,3],[104,1,104,3],[105,1,105,3],[116,1,116,3],[117,1,117,3],[118,1,118,3],[109,1,109,3],[112,1,112,3],[115,1,115,3],[107,1,107,3],[114,1,114,3],[108,1,108,3],[110,1,110,3],[111,1,111,3],[113,1,113,3],[89,1,89,3],[90,1,90,3],[91,1,91,3],[93,1,93,3],[83,1,83,3],[94,1,94,3],[95,1,95,3],[96,1,96,3],[98,1,98,3],[25,1,25,3],[26,1,26,3],[27,1,27,3],[29,1,29,3],[30,1,30,3],[31,1,31,3],[33,1,33,3],[56,1,56,3],[57,1,57,3],[32,1,32,3],[35,1,35,3],[51,1,51,3],[54,1,54,3],[184,1,184,3],[185,1,185,3],[222,1,222,3],[153,1,153,3],[147,1,147,3],[159,1,159,3],[161,1,161,3],[164,1,164,3],[174,1,174,3],[176,1,176,3],[180,1,180,3],[175,1,175,3],[177,1,177,3],[178,1,178,3],[179,1,179,3],[181,1,181,3],[182,1,182,3],[183,1,183,3],[186,1,186,3],[187,1,187,3],[188,1,188,3],[190,1,190,3],[189,1,189,3],[191,1,191,3],[124,1,124,3],[18,1,18,3],[23,1,23,3],[39,1,39,3],[40,1,40,3],[46,1,46,3],[47,1,47,3],[63,1,63,3],[64,1,64,3],[106,1,106,3],[48,1,48,3],[49,1,49,3],[50,1,50,3],[52,1,52,3],[34,1,34,3],[36,1,36,3],[37,1,37,3],[38,1,38,3],[41,1,41,3],[42,1,42,3],[43,1,43,3],[44,1,44,3],[45,1,45,3],[20,1,20,3],[145,4,145,5],[22,1,22,3],[58,1,58,3],[67,1,67,3],[77,1,77,3],[92,1,92,3],[97,1,97,3],[59,1,59,3],[60,1,60,3],[61,1,61,3],[62,1,62,3],[65,1,65,3],[66,1,66,3],[68,1,68,3],[69,1,69,3],[70,1,70,3],[71,1,71,3],[72,1,72,3],[73,1,73,3],[74,1,74,3],[75,1,75,3],[76,1,76,3],[81,1,81,3],[82,1,82,3],[161,4,161,5],[164,4,164,5],[170,4,170,5],[174,4,174,5],[147,4,147,5],[153,4,153,5],[159,4,159,5],[152,1,152,3],[151,1,151,3],[158,1,158,3],[160,1,160,3],[162,1,162,3],[163,1,163,3],[165,1,165,3],[166,1,166,3],[167,1,167,3],[168,1,168,3],[171,1,171,3],[172,1,172,3],[173,1,173,3],[156,1,156,3],[157,1,157,3],[169,1,169,3],[170,1,170,3],[230,4,230,5],[176,4,176,5],[180,4,180,5],[185,4,185,5],[189,4,189,5],[194,4,194,5],[200,4,200,5],[207,4,207,5],[223,4,223,5],[226,4,226,5],[107,4,107,5],[109,4,109,5],[112,4,112,5],[115,4,115,5],[121,4,121,5],[102,4,102,5],[102,1,102,3],[53,1,53,3],[55,1,55,3],[54,4,54,5],[58,4,58,5],[64,4,64,5],[67,4,67,5],[77,4,77,5],[88,4,88,5],[92,4,92,5],[97,4,97,5],[86,1,86,3],[87,1,87,3],[88,1,88,3],[78,1,78,3],[79,1,79,3],[80,1,80,3],[84,1,84,3],[21,4,21,5],[24,4,24,5],[28,4,28,5],[32,4,32,5],[121,1,121,3],[126,1,126,3],[132,1,132,3],[137,1,137,3],[141,1,141,3],[119,1,119,3],[120,1,120,3],[122,1,122,3],[123,1,123,3],[126,4,126,5],[132,4,132,5],[137,4,137,5],[141,4,141,5],[51,4,51,5],[35,4,35,5],[47,4,47,5],[40,4,40,5],[21,1,21,3],[24,1,24,3],[28,1,28,3],[2,1,2,3],[1,0,1,1],[1,2,1,3],[0,0,0,5],[6,4,6,5],[3,4,3,5],[19,4,19,5],[10,4,10,5],[15,4,15,5],[8,1,8,3],[9,1,9,3],[11,1,11,3],[12,1,12,3],[13,1,13,3],[14,1,14,3],[16,1,16,3],[17,1,17,3],[10,1,10,3],[15,1,15,3],[4,1,4,3],[5,1,5,3],[19,1,19,3],[6,1,6,3],[7,1,7,3]]}
["Pistes d'action        "]
[null,null,"Pistes d'action",null,null,"Mon plan d'action"]
[null,"Les pistes d'action proposées par Maison Gourmande & Responsable sont réparties en trois thèmes. Chaque thème se décompose lui-même en enjeux, objectifs et actions. Le code couleur est présenté ci-contre.\nPour accéder à un thème, cliquez sur la flèche à côté de celui-ci. \nPour chaque objectif, affichez/masquez les actions en cliquant sur le bouton correspondant.\nPour ajouter une action à votre plan d'action, il vous suffit de la cocher dans la colonne correspondante.\nSi vous souhaitez mettre une action non proposée en place, allez dans l’onglet « Mon plan d’action » et cliquez sur « Ajouter une ligne pour saisir une action » dans la thématique proposée."]
[null,null,null,null,"Cochez les actions à ajouter au plan d'action",null,null,"Premiers caractères"]
["A","Moment repas et Satisfaction"]
["A.1","Gouvernance"]
["A.1.1","Impliquer les résidents",null,null,null,null,null,3]
["A.1.1.1","Organiser une commission menu mensuelle (à la fin d'un cycle du plan alimentaire).",null,null,null,null,null,"A.1.1.1"]
["A.1.1.2","Présence régulière du chef dans la salle de restaurant ou les salles annexes (au déjeuner et au diner).",null,null,null,null,null,"A.1.1.2"]
["A.1.1.3","Créer une animation autour de la cuisine (atelier épluchure, cuisine thérapeutique, implication dans la préparation des plats ou du service...).",null,null,null,null,null,"A.1.1.3"]
["A.1.2","Impliquer les équipes",null,null,null,null,null,4]
["A.1.2.1","Réunion pluridisciplinaire du \"COPIL nutrition/MGR/restauration\" tous les 15 jours avec les équipes de soin, hôtellerie, restauration pour aborder le repas (place, textures, appétits...).",null,null,null,null,null,"A.1.2.1"]
["A.1.2.2","Former l'ensemble du personnel à l'accompagnement des personnes âgées dépendantes.",null,null,null,null,null,"A.1.2.2"]
["A.1.2.3","Déguster les plats en sortie de production.",null,null,null,null,null,"A.1.2.3"]
["A.1.2.4","Consommation du repas des résidents par au moins une des personnes du groupe de travail tous les jours / organisation d'un repas partagé.",null,null,null,null,null,"A.1.2.4"]
["A.1.3","Formaliser une politique de restauration",null,null,null,null,null,2]
["A.1.3.1","Rédiger un document décrivant la prestation alimentaire de l'établissement (élaboration des menus, qualité des produits utilisés, journée alimentaire type, adaptation des menus, prestations pour le personnel et pour les invités, commande des repas, mise à disposition et service des repas, respect de la loi et de la réglementation, hygiène et sécurité, respect de l'environnement).",null,null,null,null,null,"A.1.3.1"]
["A.1.3.2","Communiquer sur les engagements et les actions mises en place.",null,null,null,null,null,"A.1.3.2"]
["A.2","Diagnostic",null,null,null,null,null,""]
["A.2.1","Réaliser une enquête de satisfaction",null,null,null,null,null,1]
["A.2.1.1","Réaliser une enquête de satisfaction auprès des résidents.",null,null,null,null,null,"A.2.1.1"]
["A.2.2","Suivi dans le temps",null,null,null,null,null,1]
["A.2.2.1","Organiser régulièrement un point sur l'avancée du plan d'action et des actions pour juger de l'évolution de la satisfaction (retours consommation, commission repas, échanges…).",null,null,null,null,null,"A.2.2.1"]
["A.3","Menus",null,null,null,null,null,""]
["A.3.1","Prendre en compte des goûts et dégoûts",null,null,null,null,null,3]
["A.3.1.1","Communiquer les goûts et dégoûts identifiés entre les soins, l'hôtellerie et la restauration.",null,null,null,null,null,"A.3.1.1"]
["A.3.1.2","Mettre a jour régulièrement les fiches des goûts et dégoûts.",null,null,null,null,null,"A.3.1.2"]
["A.3.1.3","Anticiper les menus alternatifs en fonction de la connaissance de ces goûts et dégoûts.",null,null,null,null,null,"A.3.1.3"]
["A.3.2","Composer des menus ayant un sens pour les résidents",null,null,null,null,null,3]
["A.3.2.1","Composer des menus variés, équilibrés, attractifs et adaptés  (manger comme à la maison, menu du terroir, menu saisonnier).",null,null,null,null,null,"A.3.2.1"]
{"$rows_left_out":205}
{"sheet":"Mon plan d'action","index":3,"n_rows":177,"n_cols":13,"rows_kept":177,"cut":false,"hidden":false,"merged":[[0,0,0,8],[2,1,2,7],[3,0,3,1],[65,0,65,8],[112,0,112,8],[3,5,3,8],[1,0,1,1],[1,3,1,4],[1,5,1,6],[5,0,5,8]]}
["Mon plan d'action    "]
[null,null,null,"Pistes d'action",null,"Mon plan d'action"]
[null,"Le plan d'action est divisé en trois thèmes. Vous pouvez le compléter en cochant les cases dans la rubrique « Pistes d’action », ce qui les ajoute automatiquement à votre plan d’action, ou bien en les rédigeant manuellement dans les lignes prévues à cet effet.\nVous pouvez ajouter des lignes pour saisir vos propres actions en cliquant sur le bouton correspondant.\nSi vous souhaitez retirer une action, cliquez sur le bouton correspondant en fin de ligne.\nUne fois votre plan d'action réalisé, vous pouvez l'imprimer en cliquant sur l'icône correspondant ci-contre."]
["Etablissement : ",null,null,{"$f":"IF('Mon établissement'!C6=\"Veuillez saisir ici votre réponse\",\"Veuillez saisir vos informations dans 'Mon établissement'\",'Mon établissement'!C6)","v":"Veuillez saisir vos informations dans 'Mon établissement'"}]
["ENJEUX","OBJECTIFS","N° DE L'ACTION","ACTIONS","INDICATEUR DE SUIVI DE L'ACTION","QUI\n(NOMS ET FONCTIONS)\nSi plusieurs personnes, mettre le référent en gras","DATE DE DÉBUT DE L'ACTION","DATE DE FIN DE L'ACTION","SUIVI DU PLAN D'ACTION"]
["Moment Repas et Satisfaction",null,null,null,null,null,null,null,null,null,null,"Premiers caractères"]
["Gouvernance","Impliquer les résidents","A.1.1.1","Organiser une commission menu mensuelle (à la fin d'un cycle du plan alimentaire).",null,null,null,null,null,null,null,"A.1.1.1","non"]
["Gouvernance","Impliquer les résidents","A.1.1.2","Présence régulière du chef dans la salle de restaurant ou les salles annexes (au déjeuner et au diner).",null,null,null,null,null,null,null,"A.1.1.2","non"]
["Gouvernance","Impliquer les résidents","A.1.1.3","Créer une animation autour de la cuisine (atelier épluchure, cuisine thérapeutique, implication dans la préparation des plats ou du service...).",null,null,null,null,null,null,null,"A.1.1.3","non"]
["Gouvernance","Impliquer les équipes","A.1.2.1","Réunion pluridisciplinaire du \"COPIL nutrition/MGR/restauration\" tous les 15 jours avec les équipes de soin, hôtellerie, restauration pour aborder le repas (place, textures, appétits...).",null,null,null,null,null,null,null,"A.1.2.1","non"]
["Gouvernance","Impliquer les équipes","A.1.2.2","Former l'ensemble du personnel à l'accompagnement des personnes âgées dépendantes.",null,null,null,null,null,null,null,"A.1.2.2","non"]
["Gouvernance","Impliquer les équipes","A.1.2.3","Déguster les plats en sortie de production.",null,null,null,null,null,null,null,"A.1.2.3","non"]
["Gouvernance","Impliquer les équipes","A.1.2.4","Consommation du repas des résidents par au moins une des personnes du groupe de travail tous les jours / organisation d'un repas partagé.",null,null,null,null,null,null,null,"A.1.2.4","non"]
["Gouvernance","Formaliser une politique de restauration","A.1.3.1","Rédiger un document décrivant la prestation alimentaire de l'établissement (élaboration des menus, qualité des produits utilisés, journée alimentaire type, adaptation des menus, prestations pour le personnel et pour les invités, commande des repas, mise à disposition et service des repas, respect de la loi et de la réglementation, hygiène et sécurité, respect de l'environnement).",null,null,null,null,null,null,null,"A.1.3.1","non"]
["Gouvernance","Formaliser une politique de restauration","A.1.3.2","Communiquer sur les engagements et les actions mises en place.",null,null,null,null,null,null,null,"A.1.3.2","non"]
["Diagnostic","Réaliser une enquête de satisfaction","A.2.1.1","Réaliser une enquête de satisfaction auprès des résidents.",null,null,null,null,null,null,null,"A.2.1.1","non"]
["Diagnostic","Suivi dans le temps","A.2.2.1","Organiser régulièrement un point sur l'avancée du plan d'action et des actions pour juger de l'évolution de la satisfaction (retours consommation, commission repas, échanges…).",null,null,null,null,null,null,null,"A.2.2.1","non"]
["Menus","Prendre en compte des goûts et dégoûts","A.3.1.1","Communiquer les goûts et dégoûts identifiés entre les soins, l'hôtellerie et la restauration.",null,null,null,null,null,null,null,"A.3.1.1","non"]
["Menus","Prendre en compte des goûts et dégoûts","A.3.1.2","Mettre a jour régulièrement les fiches des goûts et dégoûts.",null,null,null,null,null,null,null,"A.3.1.2","non"]
["Menus","Prendre en compte des goûts et dégoûts","A.3.1.3","Anticiper les menus alternatifs en fonction de la connaissance de ces goûts et dégoûts.",null,null,null,null,null,null,null,"A.3.1.3","non"]
["Menus","Composer des menus ayant un sens pour les résidents","A.3.2.1","Composer des menus variés, équilibrés, attractifs et adaptés  (manger comme à la maison, menu du terroir, menu saisonnier).",null,null,null,null,null,null,null,"A.3.2.1","non"]
["Menus","Composer des menus ayant un sens pour les résidents","A.3.2.2","Faire valider le menu  par une diététicienne.",null,null,null,null,null,null,null,"A.3.2.2","non"]
["Menus","Composer des menus ayant un sens pour les résidents","A.3.2.3","Prendre en compte les échanges en commission menu et les retours assiettes pour adapter les menus.",null,null,null,null,null,null,null,"A.3.2.3","non"]
["Menus","Connaitre et communiquer le menu du jour","A.3.3.1","Connaissance du menu et de la description des plats par tous les professionnels participants aux temps des repas.",null,null,null,null,null,null,null,"A.3.3.1","non"]
["Menus","Connaitre et communiquer le menu du jour","A.3.3.2","Afficher clairement les menus (texture normale et mixée - sauf si la texture mixée est identique à la texture normale) et sensibiliser les hôteliers et les soignants à le connaître pour l’annoncer lors du service et au cours de l’aide à l’alimentation.",null,null,null,null,null,null,null,"A.3.3.2","non"]
["Menus","Donner le choix","A.3.4.1","Proposer systématiquement une alternative au menu du jour.",null,null,null,null,null,null,null,"A.3.4.1","non"]
["Menus","Donner le choix","A.3.4.2","Définir conjointement avec la cuisine un menu de substitution minute varié (choix de hors d’œuvre, plats, accompagnements, desserts) et l’afficher dans tous les espaces de restauration afin qu’il puisse être connu.",null,null,null,null,null,null,null,"A.3.4.2","non"]
["Menus","Donner le choix","A.3.4.3","Vérifier que le personnel qui sert à table et aide à l’alimentation connait le menu de substitution et le propose si nécessaire.",null,null,null,null,null,null,null,"A.3.4.3","non"]
["Qualité des produits","Améliorer la qualité des produits","A.4.1.1","Améliorer le fait maison et l'utilisation de produits bruts.",null,null,null,null,null,null,null,"A.4.1.1","non"]
["Qualité des produits","Améliorer la qualité des produits","A.4.1.2","Améliorer le taux d'approvisionnement de produits issus de l'agriculture biologique.",null,null,null,null,null,null,null,"A.4.1.2","non"]
{"$rows_left_out":148}
{"sheet":"pour_master","index":4,"n_rows":172,"n_cols":7,"rows_kept":172,"cut":false,"hidden":true,"merged":[]}
["Etablissement",{"$f":"'Mon établissement'!C6","v":"Veuillez saisir ici votre réponse"}]
["FINESS",{"$f":"'Mon établissement'!C8","v":"Veuillez saisir ici votre réponse"}]
["Code postal",{"$f":"'Mon établissement'!C14","v":"Veuillez saisir ici votre réponse"}]
["Nombre d'actions totales",{"$f":"B5+B6","v":0},"=B5+B6"]
["Nombre d'actions cochées",{"$f":"COUNTIF(G10:G172,\"oui\")","v":0},"Nombre de OUI totaux cochés"]
["Nombre d'actions rajoutées",{"$f":"COUNTIFS('Mon plan d''action'!M7:M277,\"ajout\",'Mon plan d''action'!D7:D277,\"<>?Veuillez entrer votre action ici?\",'Mon plan d''action'!D7:D277,\"<>\"&\"\")","v":0},"Nombre de OUI totaux où colonne C différent de \"Veuillez entrer votre action ici\" et de  vide"]
[]
[]
["Thème","ITEM","Objectif","Action","Nom court","ID"]
["Moment Repas","Gouvernance","Impliquer les résidents","Organiser une commission menu mensuelle (à la fin d'un cycle du plan alimentaire).","Organiser une commission menu ","A.1.1.1",{"$f":"VLOOKUP(F10,'Mon plan d''action'!$L$7:$M$276,2,FALSE)","v":"non"}]
["Moment Repas","Gouvernance","Impliquer les résidents","Présence régulière du chef dans la salle de restaurant ou les salles annexes (au déjeuner et au diner).","Présence régulière du chef dan","A.1.1.2",{"$f":"VLOOKUP(F11,'Mon plan d''action'!$L$7:$M$276,2,FALSE)","v":"non"}]
["Moment Repas","Gouvernance","Impliquer les résidents","Créer une animation autour de la cuisine (atelier épluchure, cusine thérapeutique, implication dans la préparation des plats ou du service...).","Créer une animation autour de ","A.1.1.3",{"$f":"VLOOKUP(F12,'Mon plan d''action'!$L$7:$M$276,2,FALSE)","v":"non"}]
["Moment Repas","Gouvernance","Impliquer les équipes","Réunion pluridisciplinaire du \"COPIL nutrition/MGR/restauration\" tous les 15 jours avec les équipes de soin, hôtellerie, restauration pour aborder le repas (place, textures, appétits...).","Réunion pluridisciplinaire du ","A.1.2.1",{"$f":"VLOOKUP(F13,'Mon plan d''action'!$L$7:$M$276,2,FALSE)","v":"non"}]
["Moment Repas","Gouvernance","Impliquer les équipes","Former l'ensemble du personnel à l'accompagnement des personnes âgées dépendantes.","Former l'ensemble du personnel","A.1.2.2",{"$f":"VLOOKUP(F14,'Mon plan d''action'!$L$7:$M$276,2,FALSE)","v":"non"}]
["Moment Repas","Gouvernance","Impliquer les équipes","Déguster les plats en sortie de production.","Déguster les plats en sortie d","A.1.2.3",{"$f":"VLOOKUP(F15,'Mon plan d''action'!$L$7:$M$276,2,FALSE)","v":"non"}]
["Moment Repas","Gouvernance","Impliquer les équipes","Consommation du repas des résidents par au moins une des personnes du groupe de travail tous les jours / organisation d'un repas partagé.","Consommation du repas des rési","A.1.2.4",{"$f":"VLOOKUP(F16,'Mon plan d''action'!$L$7:$M$276,2,FALSE)","v":"non"}]
["Moment Repas","Gouvernance","Formaliser une politique de restauration","Rédiger un document décrivant la prestation alimentaire de l'établissement (élaboration des menus, qualité des produits utilisés, journée alimentaire type, adaptation des menus, prestations pour le personnel et pour les invités, commande des repas, mise à disposition et service des repas, respect de la loi et de la réglementation, hygiène et sécurité, respect de l'environnement).","Rédiger un document décrivant ","A.1.3.1",{"$f":"VLOOKUP(F17,'Mon plan d''action'!$L$7:$M$276,2,FALSE)","v":"non"}]
["Moment Repas","Gouvernance","Formaliser une politique de restauration","Communiquer sur les engagements et les actions mises en place.","Communiquer sur les engagement","A.1.3.2",{"$f":"VLOOKUP(F18,'Mon plan d''action'!$L$7:$M$276,2,FALSE)","v":"non"}]
["Moment Repas","Diagnostic","Réaliser une enquête de satisfaction","Réaliser une enquête de satisfaction auprès des résidents.","Réaliser une enquête de satisf","A.2.1.1",{"$f":"VLOOKUP(F19,'Mon plan d''action'!$L$7:$M$276,2,FALSE)","v":"non"}]
["Moment Repas","Diagnostic","Suivi dans le temps","Organiser régulièrement un point sur l'avancée du plan d'action et des actions pour juger de l'évolution de la satisfaction (retours consommation, commission repas, échanges…).","Organiser régulièrement un poi","A.2.2.1",{"$f":"VLOOKUP(F20,'Mon plan d''action'!$L$7:$M$276,2,FALSE)","v":"non"}]
["Moment Repas","Menus","Prendre en compte des goûts et dégoûts","Communiquer les goûts et dégoûts identifiés entre les soins, l'hotellerie et la restauration.","Communiquer les goûts et dégoû","A.3.1.1",{"$f":"VLOOKUP(F21,'Mon plan d''action'!$L$7:$M$276,2,FALSE)","v":"non"}]
["Moment Repas","Menus","Prendre en compte des goûts et dégoûts","Mettre a jour régulièrement les fiches des goûts et dégoûts.","Mettre a jour régulièrement le","A.3.1.2",{"$f":"VLOOKUP(F22,'Mon plan d''action'!$L$7:$M$276,2,FALSE)","v":"non"}]
["Moment Repas","Menus","Prendre en compte des goûts et dégoûts","Anticiper les menus alternatifs en fonction de la connaissance de ces goûts et dégoûts.","Anticiper les menus alternatif","A.3.1.3",{"$f":"VLOOKUP(F23,'Mon plan d''action'!$L$7:$M$276,2,FALSE)","v":"non"}]
["Moment Repas","Menus","Composer des menus ayant un sens pour les résidents","Composer des menus variés, équilibrés, attractifs et adaptés  (manger comme à la maison, menu du terroir, menu saisonnier).","Composer des menus variés, équ","A.3.2.1",{"$f":"VLOOKUP(F24,'Mon plan d''action'!$L$7:$M$276,2,FALSE)","v":"non"}]
["Moment Repas","Menus","Composer des menus ayant un sens pour les résidents","Faire valider le menu  par une diététicienne.","Faire valider le menu  par une","A.3.2.2",{"$f":"VLOOKUP(F25,'Mon plan d''action'!$L$7:$M$276,2,FALSE)","v":"non"}]
["Moment Repas","Menus","Composer des menus ayant un sens pour les résidents","Prendre en compte les échanges en commission menu et les retours assiettes pour adapter les menus.","Prendre en compte les échanges","A.3.2.3",{"$f":"VLOOKUP(F26,'Mon plan d''action'!$L$7:$M$276,2,FALSE)","v":"non"}]
["Moment Repas","Menus","Connaitre et communiquer le menu du jour","Connaissance du menu et de la description des plats par tous les professionnels participants aux temps des repas.","Connaissance du menu et de la ","A.3.3.1",{"$f":"VLOOKUP(F27,'Mon plan d''action'!$L$7:$M$276,2,FALSE)","v":"non"}]
["Moment Repas","Menus","Connaitre et communiquer le menu du jour","Afficher clairement les menus (texture normale et mixée - sauf si la texture mixée est identique à la texture normale) et sensibiliser les hôteliers et les soignants à le connaître pour l’annoncer lors du service et au cours de l’aide à l’alimentation.","Afficher clairement les menus ","A.3.3.2",{"$f":"VLOOKUP(F28,'Mon plan d''action'!$L$7:$M$276,2,FALSE)","v":"non"}]
["Moment Repas","Menus","Donner le choix","Proposer systématiquement une alternative au menu du jour.","Proposer systématiquement une ","A.3.4.1",{"$f":"VLOOKUP(F29,'Mon plan d''action'!$L$7:$M$276,2,FALSE)","v":"non"}]
["Moment Repas","Menus","Donner le choix","Définir conjointement avec la cuisine un menu de substitution minute varié (choix de hors d’œuvre, plats, accompagnements, desserts) et l’afficher dans tous les espaces de restauration afin qu’il puisse être connu.","Définir conjointement avec la ","A.3.4.2",{"$f":"VLOOKUP(F30,'Mon plan d''action'!$L$7:$M$276,2,FALSE)","v":"non"}]
{"$rows_left_out":142}